Target
Wee1-like protein kinase
Ligand
BDBM50245341
Substrate
Meas. Tech.
ChEMBL_522127 (CHEMBL1006579)
IC50
14±n/a nM
Citation
 Wichapong, KLindner, MPianwanit, SKokpol, SSippl, W Receptor-based 3D-QSAR studies of checkpoint Wee1 kinase inhibitors. Eur J Med Chem 44:1383-95 (2009)  
Target
Name:
Wee1-like protein kinase
Synonyms:
Serine/threonine-protein kinase WEE1 WEE1 homolog (S. pombe) | WEE1_HUMAN
Type:
PROTEIN
Mol. Mass.:
71599.12
Organism:
Homo sapiens (Human)
Description:
ChEMBL_1445054
Residue:
646
  
Inhibitor
Name:
BDBM50245341
Synonyms:
3-(4-(2,6-dichlorophenyl)-9-hydroxy-1,3-dioxo-2,3-dihydropyrrolo[3,4-c]carbazol-6(1H)-yl)-N-(2-(dimethylamino)ethyl)propanamide | CHEMBL461116
Type:
Small organic molecule
Emp. Form.:
C27H24Cl2N4O4
Mol. Mass.:
539.41
SMILES:
CN(C)CCNC(=O)CCn1c2ccc(O)cc2c2c3C(=O)NC(=O)c3c(cc12)-c1c(Cl)cccc1Cl
: