Target
Wee1-like protein kinase
Ligand
BDBM50232241
Substrate
Meas. Tech.
ChEMBL_522127 (CHEMBL1006579)
IC50
8.9±n/a nM
Citation
 Wichapong, KLindner, MPianwanit, SKokpol, SSippl, W Receptor-based 3D-QSAR studies of checkpoint Wee1 kinase inhibitors. Eur J Med Chem 44:1383-95 (2009)  
Target
Name:
Wee1-like protein kinase
Synonyms:
Serine/threonine-protein kinase WEE1 WEE1 homolog (S. pombe) | WEE1_HUMAN
Type:
PROTEIN
Mol. Mass.:
71599.12
Organism:
Homo sapiens (Human)
Description:
ChEMBL_1445054
Residue:
646
  
Inhibitor
Name:
BDBM50232241
Synonyms:
4-(2-Chlorophenyl)-9-hydroxy-6-(3-hydroxypropyl)-pyrrolo[3,4-c]carbazole-1,3(2H,6H )-dione CHEMBL411662
Type:
Small organic molecule
Emp. Form.:
C23H17ClN2O4
Mol. Mass.:
420.845
SMILES:
OCCCn1c2ccc(O)cc2c2c3C(=O)NC(=O)c3c(cc12)-c1ccccc1Cl
: