Target
Wee1-like protein kinase
Ligand
BDBM50192377
Substrate
Meas. Tech.
ChEMBL_522127 (CHEMBL1006579)
IC50
15±n/a nM
Citation
 Wichapong, KLindner, MPianwanit, SKokpol, SSippl, W Receptor-based 3D-QSAR studies of checkpoint Wee1 kinase inhibitors. Eur J Med Chem 44:1383-95 (2009)  
Target
Name:
Wee1-like protein kinase
Synonyms:
Serine/threonine-protein kinase WEE1 WEE1 homolog (S. pombe) | WEE1_HUMAN
Type:
PROTEIN
Mol. Mass.:
71599.12
Organism:
Homo sapiens (Human)
Description:
ChEMBL_1445054
Residue:
646
  
Inhibitor
Name:
BDBM50192377
Synonyms:
4-(2-chloro-6-methoxyphenyl)-9-hydroxypyrrolo[3,4-c]carbazole-1,3(2H,6H)-dione | CHEMBL215485
Type:
Small organic molecule
Emp. Form.:
C21H13ClN2O4
Mol. Mass.:
392.792
SMILES:
COc1cccc(Cl)c1-c1cc2[nH]c3ccc(O)cc3c2c2C(=O)NC(=O)c12
: