Target
Adenosine receptor A2b
Ligand
BDBM50170137
Substrate
Meas. Tech.
ChEMBL_559971 (CHEMBL1014570)
IC50
400±n/a nM
Citation
 Baraldi, PGPreti, DTabrizi, MARomagnoli, RSaponaro, GBaraldi, SBotta, MBernardini, CTafi, ATuccinardi, TMartinelli, AVarani, KBorea, PA Structure-activity relationship studies of a new series of imidazo[2,1-f]purinones as potent and selective A(3) adenosine receptor antagonists. Bioorg Med Chem 16:10281-94 (2008)  
Target
Name:
Adenosine receptor A2b
Synonyms:
AA2BR_HUMAN ADORA2B Adenosine receptors A2b | Adenosine receptors; A2a & A2b
Type:
G Protein-Coupled Receptor (GPCR)
Mol. Mass.:
36341.22
Organism:
Homo sapiens (Human)
Description:
Residue:
332
  
Inhibitor
Name:
BDBM50170137
Synonyms:
1-Benzyl-7-methyl-3-propyl-1H,6H-pyrrolo[2,1-f]purine-2,4-dione CHEMBL189904
Type:
Small organic molecule
Emp. Form.:
C19H20N4O2
Mol. Mass.:
336.3877
SMILES:
CCCn1c(=O)n(Cc2ccccc2)c2nc3C=C(C)Cn3c2c1=O
: