Target
Xanthine dehydrogenase/oxidase
Ligand
BDBM50254557
Substrate
Meas. Tech.
ChEMBL_558736 (CHEMBL954138)
IC50
>10000000±n/a nM
Citation
 Sato, TAshizawa, NIwanaga, TNakamura, HMatsumoto, KInoue, TNagata, O Design, synthesis, and pharmacological and pharmacokinetic evaluation of 3-phenyl-5-pyridyl-1,2,4-triazole derivatives as xanthine oxidoreductase inhibitors. Bioorg Med Chem Lett 19:184-7 (2008)  
Target
Name:
Xanthine dehydrogenase/oxidase
Synonyms:
XDH Xanthine dehydrogenase Xanthine oxidase (XO)
Type:
Protein
Mol. Mass.:
146809.00
Organism:
Bos taurus (Bovine)
Description:
P80457
Residue:
1332
  
Inhibitor
Name:
BDBM50254557
Synonyms:
2-chloro-4-(5-(4-isobutoxy-3-nitrophenyl)-1H-1,2,4-triazol-3-yl)-6-methylpyridine | CHEMBL462495
Type:
Small organic molecule
Emp. Form.:
C18H18ClN5O3
Mol. Mass.:
387.82
SMILES:
CC(C)COc1ccc(cc1[N+]([O-])=O)-c1nnc([nH]1)-c1cc(C)nc(Cl)c1
: