Target
Apoptosis regulator Bcl-2
Ligand
BDBM50254531
Substrate
Meas. Tech.
ChEMBL_558763 (CHEMBL1019892)
IC50
140±n/a nM
Citation
 Porter, JPayne, Ade Candole, BFord, DHutchinson, BTrevitt, GTurner, JEdwards, CWatkins, CWhitcombe, IDavis, JStubberfield, C Tetrahydroisoquinoline amide substituted phenyl pyrazoles as selective Bcl-2 inhibitors. Bioorg Med Chem Lett 19:230-3 (2008)  
Target
Name:
Apoptosis regulator Bcl-2
Synonyms:
Apoptosis regulator Bcl-2 Protein BCL-2 BCL2_HUMAN | Bcl-2 Protein
Type:
Homodimer or heterodimer
Mol. Mass.:
26269.11
Organism:
Homo sapiens (Human)
Description:
P10415
Residue:
239
  
Inhibitor
Name:
BDBM50254531
Synonyms:
5-methyl-1-(2-((S)-3-((methylamino)methyl)-1,2,3,4-tetrahydroisoquinoline-2-carbonyl)phenyl)-N,N-diphenyl-1H-pyrazole-3-carboxamide | CHEMBL500866
Type:
Small organic molecule
Emp. Form.:
C35H33N5O2
Mol. Mass.:
555.6688
SMILES:
CNC[C@@H]1Cc2ccccc2CN1C(=O)c1ccccc1-n1nc(cc1C)C(=O)N(c1ccccc1)c1ccccc1
: