Target
Ephrin type-A receptor 4
Ligand
BDBM26145
Substrate
Meas. Tech.
ChEMBL_537102 (CHEMBL988934)
Kd
5±n/a nM
Citation
 Bamborough, PDrewry, DHarper, GSmith, GKSchneider, K Assessment of chemical coverage of kinome space and its implications for kinase drug discovery. J Med Chem 51:7898-914 (2008)  
Target
Name:
Ephrin type-A receptor 4
Synonyms:
EPHA4 Ephrin receptor HEK8 TYRO1
Type:
PROTEIN
Mol. Mass.:
109859.29
Organism:
Homo sapiens (Human)
Description:
ChEMBL_586961
Residue:
986
  
Inhibitor
Name:
BDBM26145
Synonyms:
2,4-dianilino pyrimidine, 2 CHEMBL249097
Type:
Small organic molecule
Emp. Form.:
C18H17N5O2
Mol. Mass.:
335.3599
SMILES:
Cc1ccc(O)cc1Nc1ccnc(Nc2cccc(c2)C(N)=O)n1
: