Target
Casein kinase I isoform delta
Ligand
BDBM50273635
Substrate
Meas. Tech.
ChEMBL_537116 (CHEMBL988948)
Kd
58±n/a nM
Citation
 Bamborough, PDrewry, DHarper, GSmith, GKSchneider, K Assessment of chemical coverage of kinome space and its implications for kinase drug discovery. J Med Chem 51:7898-914 (2008)  
Target
Name:
Casein kinase I isoform delta
Synonyms:
CKI-delta CSNK1D Casein kinase I delta Casein kinase I isoform delta (CK1D) KC1D_HUMAN | casein kinases 1 delta (CK1 delta)
Type:
Enzyme
Mol. Mass.:
47356.76
Organism:
Homo sapiens (Human)
Description:
P48730
Residue:
415
  
Inhibitor
Name:
BDBM50273635
Synonyms:
1-(4-methyl-2,5-di(pyridin-4-yl)-1H-pyrrol-3-yl)ethanone | CHEMBL526901
Type:
Small organic molecule
Emp. Form.:
C17H15N3O
Mol. Mass.:
277.3205
SMILES:
CC(=O)c1c(C)c([nH]c1-c1ccncc1)-c1ccncc1
: