Target
Tyrosine-protein kinase JAK2
Ligand
BDBM50230828
Substrate
Meas. Tech.
ChEMBL_538120 (CHEMBL1025762)
Ki
5±n/a nM
Citation
 Bamborough, PDrewry, DHarper, GSmith, GKSchneider, K Assessment of chemical coverage of kinome space and its implications for kinase drug discovery. J Med Chem 51:7898-914 (2008)  
Target
Name:
Tyrosine-protein kinase JAK2
Synonyms:
JAK-2 JAK2_HUMAN Janus kinase 2 (JAK2) | Janus kinase 2 (a protein tyrosine kinase)
Type:
Protein
Mol. Mass.:
130684.68
Organism:
Homo sapiens (Human)
Description:
O60674
Residue:
1132
  
Inhibitor
Name:
BDBM50230828
Synonyms:
5-(4-fluorophenyl)-2-ureidothiophene-3-carboxamide [5-(p-fluorophenyl)-2-ureido]thiophene-3-carboxamide
Type:
Small organic molecule
Emp. Form.:
C12H10FN3O2S
Mol. Mass.:
279.29
SMILES:
NC(=O)Nc1sc(cc1C(N)=O)-c1ccc(F)cc1
: