Target
Suppressor of tumorigenicity 14 protein
Ligand
BDBM50254410
Substrate
Meas. Tech.
ChEMBL_559006 (CHEMBL1010203)
Ki
1.6±n/a nM
Citation
 Steinmetzer, TDönnecke, DKorsonewski, MNeuwirth, CSteinmetzer, PSchulze, ASaupe, SMSchweinitz, A Modification of the N-terminal sulfonyl residue in 3-amidinophenylalanine-based matriptase inhibitors. Bioorg Med Chem Lett 19:67-73 (2008)  
Target
Name:
Suppressor of tumorigenicity 14 protein
Synonyms:
Epithin MT-SP1 PRSS14 SNC19 ST14_HUMAN Suppressor of tumorigenicity 14 protein TADG15
Type:
Single-pass type II membrane protein
Mol. Mass.:
94769.23
Organism:
Homo sapiens (Human)
Description:
Q9Y5Y6
Residue:
855
  
Inhibitor
Name:
BDBM50254410
Synonyms:
3-{(S)-3-[4-(2-Amino-ethyl)-piperidin-1-yl]-2-[3-(6-amino-pyridin-3-yl)-benzenesulfonylamino]-3-oxo-propyl}-benzamidine | CHEMBL461016
Type:
Small organic molecule
Emp. Form.:
C28H35N7O3S
Mol. Mass.:
549.688
SMILES:
NCCC1CCN(CC1)C(=O)[C@H](Cc1cccc(c1)C(N)=N)NS(=O)(=O)c1cccc(c1)-c1ccc(N)nc1
: