Target
Prothrombin
Ligand
BDBM23917
Substrate
Meas. Tech.
ChEMBL_559003 (CHEMBL1010200)
Ki
27000±n/a nM
Citation
 Steinmetzer, TDönnecke, DKorsonewski, MNeuwirth, CSteinmetzer, PSchulze, ASaupe, SMSchweinitz, A Modification of the N-terminal sulfonyl residue in 3-amidinophenylalanine-based matriptase inhibitors. Bioorg Med Chem Lett 19:67-73 (2008)  
Target
Name:
Prothrombin
Synonyms:
Activation peptide fragment 1 Coagulation factor II Prothrombin precursor Thrombin heavy chain | Thrombin light chain
Type:
Protein
Mol. Mass.:
70029.57
Organism:
Homo sapiens (Human)
Description:
P00734
Residue:
622
  
Inhibitor
Name:
BDBM23917
Synonyms:
3-amidinophenylalanine deriv., 59 CHEMBL379194
Type:
Small organic molecule
Emp. Form.:
C26H37N7O4S
Mol. Mass.:
543.681
SMILES:
NCCC1CCN(CC1)C(=O)[C@H](Cc1cccc(c1)C(N)=N)NS(=O)(=O)c1cccc(NC(=O)CCN)c1
: