Target
Coagulation factor X
Ligand
BDBM50266083
Substrate
Meas. Tech.
ChEMBL_544730 (CHEMBL1010168)
Ki
0.78±n/a nM
Citation
 Qiao, JXKing, SRHe, KWong, PCRendina, ARLuettgen, JMXin, BKnabb, RMWexler, RRLam, PY Highly efficacious factor Xa inhibitors containing alpha-substituted phenylcycloalkyl P4 moieties. Bioorg Med Chem Lett 19:462-8 (2008)  
Target
Name:
Coagulation factor X
Synonyms:
Activated coagulation factor X (FXa) Coagulation factor X precursor F10 Factor X heavy chain Factor Xa Stuart-Prower factor
Type:
Enzyme
Mol. Mass.:
54726.60
Organism:
Homo sapiens (Human)
Description:
Residue:
488
  
Inhibitor
Name:
BDBM50266083
Synonyms:
6-(4-(1-aminocyclopropyl)phenyl)-1-(4-methoxyphenyl)-3-(trifluoromethyl)-5,6-dihydro-1H-pyrazolo[3,4-c]pyridin-7(4H)-one | CHEMBL515847
Type:
Small organic molecule
Emp. Form.:
C23H21F3N4O2
Mol. Mass.:
442.4336
SMILES:
COc1ccc(cc1)-n1nc(c2CCN(C(=O)c12)c1ccc(cc1)C1(N)CC1)C(F)(F)F
: