Target
Coagulation factor X
Ligand
BDBM50266250
Substrate
Meas. Tech.
ChEMBL_544730 (CHEMBL1010168)
Ki
0.16±n/a nM
Citation
 Qiao, JXKing, SRHe, KWong, PCRendina, ARLuettgen, JMXin, BKnabb, RMWexler, RRLam, PY Highly efficacious factor Xa inhibitors containing alpha-substituted phenylcycloalkyl P4 moieties. Bioorg Med Chem Lett 19:462-8 (2008)  
Target
Name:
Coagulation factor X
Synonyms:
Activated coagulation factor X (FXa) Coagulation factor X precursor F10 Factor X heavy chain Factor Xa Stuart-Prower factor
Type:
Enzyme
Mol. Mass.:
54726.60
Organism:
Homo sapiens (Human)
Description:
Residue:
488
  
Inhibitor
Name:
BDBM50266250
Synonyms:
1-(4-methoxyphenyl)-6-(4-(1-(1-methyl-4,5-dihydro-1H-imidazol-2-yl)cyclopropyl)phenyl)-3-(trifluoromethyl)-5,6-dihydro-1H-pyrazolo[3,4-c]pyridin-7(4H)-one | CHEMBL516297
Type:
Small organic molecule
Emp. Form.:
C27H26F3N5O2
Mol. Mass.:
509.5228
SMILES:
COc1ccc(cc1)-n1nc(c2CCN(C(=O)c12)c1ccc(cc1)C1(CC1)C1=NCCN1C)C(F)(F)F
: