Target
Caspase-1
Ligand
BDBM50273339
Substrate
Meas. Tech.
ChEMBL_537867 (CHEMBL990679)
EC50
>5000±n/a nM
Citation
 Smith, GGlaser, MPerumal, MNguyen, QDShan, BArstad, EAboagye, EO Design, synthesis, and biological characterization of a caspase 3/7 selective isatin labeled with 2-[18F]fluoroethylazide. J Med Chem 51:8057-67 (2008)  
Target
Name:
Caspase-1
Synonyms:
CASP1 Caspase ICE IL1BCE Interleukin-1 beta-converting enzyme
Type:
Enzyme
Mol. Mass.:
45154.13
Organism:
Homo sapiens (Human)
Description:
P29466
Residue:
404
  
Inhibitor
Name:
BDBM50273339
Synonyms:
(S)-1-(4-Fluorobenzyl)-5-(2-((1-(2-fluoroethyl)-1H-[1,2,3]-triazol-4-yl)methoxymethyl)-pyrrolidine-1-sulfonyl)isatin | CHEMBL518382
Type:
Small organic molecule
Emp. Form.:
C25H25F2N5O5S
Mol. Mass.:
545.558
SMILES:
FCCn1cc(COC[C@@H]2CCCN2S(=O)(=O)c2ccc3N(Cc4ccc(F)cc4)C(=O)C(=O)c3c2)nn1
: