Target
Caspase-1
Ligand
BDBM50273926
Substrate
Meas. Tech.
ChEMBL_537867 (CHEMBL990679)
EC50
>5000±n/a nM
Citation
 Smith, GGlaser, MPerumal, MNguyen, QDShan, BArstad, EAboagye, EO Design, synthesis, and biological characterization of a caspase 3/7 selective isatin labeled with 2-[18F]fluoroethylazide. J Med Chem 51:8057-67 (2008)  
Target
Name:
Caspase-1
Synonyms:
CASP1 Caspase ICE IL1BCE Interleukin-1 beta-converting enzyme
Type:
Enzyme
Mol. Mass.:
45154.13
Organism:
Homo sapiens (Human)
Description:
P29466
Residue:
404
  
Inhibitor
Name:
BDBM50273926
Synonyms:
1-(4-Fluorobenzyl)-5-(pyrrolidine-1-sulfonyl)isatin | CHEMBL461248
Type:
Small organic molecule
Emp. Form.:
C19H17FN2O4S
Mol. Mass.:
388.413
SMILES:
Fc1ccc(CN2C(=O)C(=O)c3cc(ccc23)S(=O)(=O)N2CCCC2)cc1
: