Target
11-beta-hydroxysteroid dehydrogenase 1
Ligand
BDBM50273823
Substrate
Meas. Tech.
ChEMBL_561232 (CHEMBL1012778)
Ki
83±n/a nM
Citation
 Fotsch, CBartberger, MDBercot, EAChen, MCupples, REmery, MFretland, JGuram, AHale, CHan, NHickman, DHungate, RWHayashi, MKomorowski, RLiu, QMatsumoto, GSt Jean, DJUrsu, SVéniant, MXu, GYe, QYuan, CZhang, JZhang, XTu, HWang, M Further studies with the 2-amino-1,3-thiazol-4(5H)-one class of 11beta-hydroxysteroid dehydrogenase type 1 inhibitors: reducing pregnane X receptor activity and exploring activity in a monkey pharmacodynamic model. J Med Chem 51:7953-67 (2008)  
Target
Name:
11-beta-hydroxysteroid dehydrogenase 1
Synonyms:
11-DH 11-beta-Hydroxysteroid Dehydrogenase 1 (11-beta-HSD1) 11-beta-hydroxysteroid dehydrogenase 1 (11HSD1) Corticosteroid 11-beta-dehydrogenase isozyme 1 (11-beta-HSD-1) Corticosteroid 11-beta-dehydrogenase isozyme 1 (11beta-HSD1) HSD11 HSD11L | SDR26C1
Type:
Enzyme
Mol. Mass.:
32409.16
Organism:
Homo sapiens (Human)
Description:
P28845
Residue:
292
  
Inhibitor
Name:
BDBM50273823
Synonyms:
2-(4-{2-[(S)-1-(4-Fluorophenyl)ethylamino]-5-methyl-4-oxo-4,5-dihydrothiazol-5-yl}phenyl)-2-methylpropanamide | CHEMBL505071
Type:
Small organic molecule
Emp. Form.:
C22H24FN3O2S
Mol. Mass.:
413.508
SMILES:
C[C@H](NC1=NC(=O)C(C)(S1)c1ccc(cc1)C(C)(C)C(N)=O)c1ccc(F)cc1
: