Target
Calcitonin gene-related peptide 1
Ligand
BDBM50025092
Substrate
Meas. Tech.
ChEMBL_556924 (CHEMBL954950)
IC50
30±n/a nM
Citation
 Miranda, LPHolder, JRShi, LBennett, BAral, JGegg, CVWright, MWalker, KDoellgast, GRogers, RLi, HValladares, VSalyers, KJohnson, EWild, K Identification of potent, selective, and metabolically stable peptide antagonists to the calcitonin gene-related peptide (CGRP) receptor. J Med Chem 51:7889-97 (2008)  
Target
Name:
Calcitonin gene-related peptide 1
Synonyms:
CALC1 CALCA_HUMAN Calcitonin gene-related peptide (CGRP alpha) | Calcitonin gene-related peptide 1
Type:
Enzyme
Mol. Mass.:
13902.80
Organism:
Homo sapiens (Human)
Description:
P06881
Residue:
128
  
Inhibitor
Name:
BDBM50025092
Synonyms:
CHEMBL2372189
Type:
Small organic molecule
Emp. Form.:
C167H249N45O41
Mol. Mass.:
3543.0409
SMILES:
CC(C)C[C@H](NC(=O)CNC(=O)[C@H](C)NC(=O)[C@H](CC(C)C)NC(=O)[C@H](CCCNC(N)=O)NC(=O)[C@H](Cc1cnc[nH]1)NC(=O)[C@@H](NC(=O)[C@@H](NC(=O)[C@H](Cc1c[nH]c2ccccc12)NC(C)=O)C(C)C)[C@@H](C)O)C(=O)N[C@@H](CC(C)C)C(=O)N[C@@H](CO)C(=O)N[C@@H](CCCNC(N)=O)C(=O)N[C@@H](CO)C(=O)NCC(=O)NCC(=O)N[C@@H](C(C)C)C(=O)N[C@@H](C(C)C)C(=O)N[C@@H](CCCCNC(N)=N)C(=O)N[C@@H](CCCCN)C(=O)N[C@@H](CC(N)=O)C(=O)N[C@@H](Cc1ccccc1)C(=O)N[C@@H](C(C)C)C(=O)N1CCC[C@H]1C(=O)N[C@@H]([C@@H](C)O)C(=O)N[C@@H](CC(O)=O)C(=O)N[C@@H](C(C)C)C(=O)NCC(=O)N1Cc2[nH]c3ccccc3c2C[C@H]1C(=O)N[C@@H](Cc1ccccc1)C(=O)N[C@@H](C)C(=O)N[C@@H](Cc1ccccc1)C(N)=O
: