Target
Cytochrome P450 3A4
Ligand
BDBM50247128
Substrate
Meas. Tech.
ChEMBL_556964 (CHEMBL958150)
IC50
>10000±n/a nM
Citation
 Thoma, GStreiff, MBKovarik, JGlickman, FWagner, TBeerli, CZerwes, HG Orally bioavailable isothioureas block function of the chemokine receptor CXCR4 in vitro and in vivo. J Med Chem 51:7915-20 (2008)  
Target
Name:
Cytochrome P450 3A4
Synonyms:
Albendazole monooxygenase CP3A4_HUMAN CYP3A4 CYPIIIA4 Cytochrome P450 3A4 (CYP3A4) Nifedipine oxidase Taurochenodeoxycholate 6-alpha-hydroxylase
Type:
Enzyme
Mol. Mass.:
57349.57
Organism:
Homo sapiens (Human)
Description:
Residue:
503
  
Inhibitor
Name:
BDBM50247128
Synonyms:
(6,6-dimethyl-5,6-dihydroimidazo[2,1-b][1,3]thiazol-3-yl)methyl N,N'-dicyclohexylimidothiocarbamate CHEMBL460491
Type:
Small organic molecule
Emp. Form.:
C21H34N4S2
Mol. Mass.:
406.651
SMILES:
CC1(C)CN2C(CS\C(NC3CCCCC3)=N/C3CCCCC3)=CSC2=N1
: