Target
Oxytocin receptor
Ligand
BDBM50246575
Substrate
Meas. Tech.
ChEMBL_561007 (CHEMBL1015247)
Ki
>10000±n/a nM
Citation
 Yea, CMAllan, CEAshworth, DMBarnett, JBaxter, AJBroadbridge, JDFranklin, RJHampton, SLHudson, PHorton, JAJenkins, PDPenson, AMPitt, GRRivière, PRobson, PARooker, DPSemple, GSheppard, AHaigh, RMRoe, MB New benzylureas as a novel series of potent, nonpeptidic vasopressin V2 receptor agonists. J Med Chem 51:8124-34 (2008)  
Target
Name:
Oxytocin receptor
Synonyms:
OT-R OXYR_HUMAN | Oxytocin
Type:
Enzyme Catalytic Domain
Mol. Mass.:
42793.26
Organism:
Homo sapiens (Human)
Description:
Oxytocin OXTR HEK293::B2R9L7
Residue:
389
  
Inhibitor
Name:
BDBM50246575
Synonyms:
1-(2-Methyl-4-(2,3,4,5-tetrahydro-1-benzazepin-1-ylcarbonyl)benzylcarbamoyl)-L-proline-N,N-dimethylamide VA-106483
Type:
Small organic molecule
Emp. Form.:
C27H34N4O3
Mol. Mass.:
462.5839
SMILES:
CN(C)C(=O)[C@@H]1CCCN1C(=O)NCc1ccc(cc1C)C(=O)N1CCCCc2ccccc12
: