Target
Oxytocin receptor
Ligand
BDBM50246925
Substrate
Meas. Tech.
ChEMBL_561007 (CHEMBL1015247)
Ki
>10000±n/a nM
Citation
 Yea, CMAllan, CEAshworth, DMBarnett, JBaxter, AJBroadbridge, JDFranklin, RJHampton, SLHudson, PHorton, JAJenkins, PDPenson, AMPitt, GRRivière, PRobson, PARooker, DPSemple, GSheppard, AHaigh, RMRoe, MB New benzylureas as a novel series of potent, nonpeptidic vasopressin V2 receptor agonists. J Med Chem 51:8124-34 (2008)  
Target
Name:
Oxytocin receptor
Synonyms:
OT-R OXYR_HUMAN | Oxytocin
Type:
Enzyme Catalytic Domain
Mol. Mass.:
42793.26
Organism:
Homo sapiens (Human)
Description:
Oxytocin OXTR HEK293::B2R9L7
Residue:
389
  
Inhibitor
Name:
BDBM50246925
Synonyms:
1-(4-[3-(2,6-Difluorophenyl)ureidomethyl]-3-methylbenzoyl)-2,3,4,5-tetrahydro-1H-1-benzazepine | CHEMBL455699
Type:
Small organic molecule
Emp. Form.:
C26H25F2N3O2
Mol. Mass.:
449.4924
SMILES:
Cc1cc(ccc1CNC(=O)Nc1c(F)cccc1F)C(=O)N1CCCCc2ccccc12
: