Target
Adenosine receptor A1
Ligand
BDBM50265986
Substrate
Meas. Tech.
ChEMBL_540181 (CHEMBL1029810)
Ki
1240±n/a nM
Citation
 Cole, AGStauffer, TMRokosz, LLMetzger, ADillard, LWZeng, WHenderson, I Synthesis of 2-amino-5-benzoyl-4-(2-furyl)thiazoles as adenosine A(2A) receptor antagonists. Bioorg Med Chem Lett 19:378-81 (2008)  
Target
Name:
Adenosine receptor A1
Synonyms:
A1 adenosine receptor (hA1) AA1R_HUMAN ADORA1 Adenosine A1-receptor Adenosine receptor A1 (hA1) | Adenosine transporter (AdT)
Type:
G Protein-Coupled Receptor (GPCR)
Mol. Mass.:
36520.92
Organism:
Homo sapiens (Human)
Description:
P30542
Residue:
326
  
Inhibitor
Name:
BDBM50265986
Synonyms:
1-(4-(5-benzoyl-4-(furan-2-yl)thiazol-2-ylamino)piperidin-1-yl)ethanone | CHEMBL460384
Type:
Small organic molecule
Emp. Form.:
C21H21N3O3S
Mol. Mass.:
395.475
SMILES:
CC(=O)N1CCC(CC1)Nc1nc(-c2ccco2)c(s1)C(=O)c1ccccc1
: