Target
Kappa-type opioid receptor
Ligand
BDBM50277101
Substrate
Meas. Tech.
ChEMBL_540502 (CHEMBL1030606)
Ki
0.063000±n/a nM
Citation
 Wentland, MPLu, QGanorkar, RZhang, SZJo, SCohen, DJBidlack, JM Redefining the structure-activity relationships of 2,6-methano-3-benzazocines. Part 7: syntheses and opioid receptor properties of cyclic variants of cyclazocine. Bioorg Med Chem Lett 19:365-8 (2008)  
Target
Name:
Kappa-type opioid receptor
Synonyms:
K-OR-1 Kappa-opioid receptor (KOR) Kappa-type opioid receptor (KOR) OPIATE Kappa OPRK1 kappa opioid receptor (KOR)
Type:
G Protein-Coupled Receptor (GPCR)
Mol. Mass.:
42648.76
Organism:
Homo sapiens (Human)
Description:
P41145
Residue:
380
  
Inhibitor
Name:
BDBM50277101
Synonyms:
(1S,16R)-13-(cyclopropylmethyl)-1,16-dimethyl-5,7,13-triazatetracyclo[10.3.1.0^{2,10}.0^{4,8}]hexadeca-2,4(8),6,9-tetraene | CHEMBL518712
Type:
Small organic molecule
Emp. Form.:
C19H25N3
Mol. Mass.:
295.4219
SMILES:
C[C@H]1C2Cc3cc4[nH]cnc4cc3[C@@]1(C)CCN2CC1CC1
: