Target
Macrophage colony-stimulating factor 1 receptor
Ligand
BDBM50255145
Substrate
Meas. Tech.
ChEMBL_515273 (CHEMBL991297)
IC50
9±n/a nM
Citation
 Scott, DABalliet, CLCook, DJDavies, AMGero, TWOmer, CAPoondru, STheoclitou, METyurin, BZinda, MJ Identification of 3-amido-4-anilinoquinolines as potent and selective inhibitors of CSF-1R kinase. Bioorg Med Chem Lett 19:697-700 (2009)  
Target
Name:
Macrophage colony-stimulating factor 1 receptor
Synonyms:
CSF1R FMS Macrophage colony stimulating factor receptor Macrophage colony-stimulating factor 1 receptor (c-FMS) Proto-oncogene c-Fms c-fms | cFMS
Type:
Protein
Mol. Mass.:
107979.48
Organism:
Homo sapiens (Human)
Description:
P07333
Residue:
972
  
Inhibitor
Name:
BDBM50255145
Synonyms:
4-(2-fluorophenylamino)-6,7-dimethoxyquinoline-3-carboxamide | CHEMBL442591
Type:
Small organic molecule
Emp. Form.:
C18H16FN3O3
Mol. Mass.:
341.3363
SMILES:
COc1cc2ncc(C(N)=O)c(Nc3ccccc3F)c2cc1OC
: