Target
Histone deacetylase 2
Ligand
BDBM24624
Substrate
Meas. Tech.
ChEMBL_515333 (CHEMBL1036510)
IC50
290±n/a nM
Citation
 Raeppel, SZhou, NGaudette, FLeit, SPaquin, ILarouche, GMoradei, OFréchette, SIsakovic, LDelorme, DFournel, MKalita, ALu, ATrachy-Bourget, MCYan, PTLiu, JRahil, JWang, JBesterman, JMMurakami, KLi, ZVaisburg, A SAR and biological evaluation of analogues of a small molecule histone deacetylase inhibitor N-(2-aminophenyl)-4-((4-(pyridin-3-yl)pyrimidin-2-ylamino)methyl)benzamide (MGCD0103). Bioorg Med Chem Lett 19:644-9 (2009)  
Target
Name:
Histone deacetylase 2
Synonyms:
Cereblon/Histone deacetylase 2 HDAC2 Histone deacetylase 2 (HDAC2) | Human HDAC2
Type:
Chromatin regulator; hydrolase; repressor
Mol. Mass.:
55356.54
Organism:
Homo sapiens (Human)
Description:
Q92769
Residue:
488
  
Inhibitor
Name:
BDBM24624
Synonyms:
CHEMBL272980 MGCD0103 US10227295, Compound MGCD0103 US9409858, MGCD0103 US9956192, Compound MGCD0103
Type:
Small organic molecule
Emp. Form.:
C23H20N6O
Mol. Mass.:
396.4445
SMILES:
Nc1ccccc1NC(=O)c1ccc(CNc2nccc(n2)-c2cccnc2)cc1
: