Target
Poly [ADP-ribose] polymerase 1
Ligand
BDBM50130580
Substrate
Meas. Tech.
ChEMBL_515852 (CHEMBL993111)
IC50
180±n/a nM
Citation
 Zhang, WTRuan, JLWu, PFJiang, FCZhang, LNFang, WChen, XLWang, YCao, BSChen, GYZhu, YJGu, JChen, JG Design, synthesis, and cytoprotective effect of 2-aminothiazole analogues as potent poly(ADP-ribose) polymerase-1 inhibitors. J Med Chem 52:718-25 (2009)  
Target
Name:
Poly [ADP-ribose] polymerase 1
Synonyms:
(ARTD1 or PARP1) 2.4.2.30 ADPRT ARTD1 Human diphtheria toxin-like ADP-ribosyltransferase (ARTD1 or PARP1) NT-PARP-1 PARP1 PPOL Poly [ADP-ribose] polymerase 1 (PARP) Poly [ADP-ribose] polymerase 1 (PARP1) Poly [ADP-ribose] polymerase 1, 28-kDa form Poly [ADP-ribose] polymerase 1, processed C-terminus Poly [ADP-ribose] polymerase-1 Poly(ADP-ribose) polymerase-1 (ARTD1/PARP1) Protein poly-ADP-ribosyltransferase PARP1 | Synonyms=ADPRT
Type:
Mol. Mass.:
113114.22
Organism:
Homo sapiens (Human)
Description:
P09874
Residue:
1014
  
Inhibitor
Name:
BDBM50130580
Synonyms:
3-Amino-5H-benzo[c][1,5]naphthyridin-6-one CHEMBL106154
Type:
Small organic molecule
Emp. Form.:
C12H9N3O
Mol. Mass.:
211.2194
SMILES:
Nc1cnc2c(c1)[nH]c(=O)c1ccccc21
: