Target
Poly [ADP-ribose] polymerase 1
Ligand
BDBM50165481
Substrate
Meas. Tech.
ChEMBL_515852 (CHEMBL993111)
IC50
90±n/a nM
Citation
 Zhang, WTRuan, JLWu, PFJiang, FCZhang, LNFang, WChen, XLWang, YCao, BSChen, GYZhu, YJGu, JChen, JG Design, synthesis, and cytoprotective effect of 2-aminothiazole analogues as potent poly(ADP-ribose) polymerase-1 inhibitors. J Med Chem 52:718-25 (2009)  
Target
Name:
Poly [ADP-ribose] polymerase 1
Synonyms:
(ARTD1 or PARP1) 2.4.2.30 ADPRT ARTD1 Human diphtheria toxin-like ADP-ribosyltransferase (ARTD1 or PARP1) NT-PARP-1 PARP1 PPOL Poly [ADP-ribose] polymerase 1 (PARP) Poly [ADP-ribose] polymerase 1 (PARP1) Poly [ADP-ribose] polymerase 1, 28-kDa form Poly [ADP-ribose] polymerase 1, processed C-terminus Poly [ADP-ribose] polymerase-1 Poly(ADP-ribose) polymerase-1 (ARTD1/PARP1) Protein poly-ADP-ribosyltransferase PARP1 | Synonyms=ADPRT
Type:
Mol. Mass.:
113114.22
Organism:
Homo sapiens (Human)
Description:
P09874
Residue:
1014
  
Inhibitor
Name:
BDBM50165481
Synonyms:
CHEMBL425560 N-[3-(4-Oxo-3,4-dihydro-phthalazin-1-ylmethyl)-phenyl]-butyramide
Type:
Small organic molecule
Emp. Form.:
C19H19N3O2
Mol. Mass.:
321.3731
SMILES:
CCCC(=O)Nc1cccc(Cc2n[nH]c(=O)c3ccccc23)c1
: