Target
Poly [ADP-ribose] polymerase 1
Ligand
BDBM27718
Substrate
Meas. Tech.
ChEMBL_515852 (CHEMBL993111)
IC50
119±n/a nM
Citation
 Zhang, WTRuan, JLWu, PFJiang, FCZhang, LNFang, WChen, XLWang, YCao, BSChen, GYZhu, YJGu, JChen, JG Design, synthesis, and cytoprotective effect of 2-aminothiazole analogues as potent poly(ADP-ribose) polymerase-1 inhibitors. J Med Chem 52:718-25 (2009)  
Target
Name:
Poly [ADP-ribose] polymerase 1
Synonyms:
(ARTD1 or PARP1) 2.4.2.30 ADPRT ARTD1 Human diphtheria toxin-like ADP-ribosyltransferase (ARTD1 or PARP1) NT-PARP-1 PARP1 PPOL Poly [ADP-ribose] polymerase 1 (PARP) Poly [ADP-ribose] polymerase 1 (PARP1) Poly [ADP-ribose] polymerase 1, 28-kDa form Poly [ADP-ribose] polymerase 1, processed C-terminus Poly [ADP-ribose] polymerase-1 Poly(ADP-ribose) polymerase-1 (ARTD1/PARP1) Protein poly-ADP-ribosyltransferase PARP1 | Synonyms=ADPRT
Type:
Mol. Mass.:
113114.22
Organism:
Homo sapiens (Human)
Description:
P09874
Residue:
1014
  
Inhibitor
Name:
BDBM27718
Synonyms:
2-(3-(4-phenyl-5,6-dihydropyridin-1(2H)-yl)propyl)phenanthridin-6(5H)-one 2-[3-(4-phenyl-1,2,3,6-tetrahydropyridin-1-yl)propyl]-5,6-dihydrophenanthridin-6-one phenanthridinone analogue, 14
Type:
Small organic molecule
Emp. Form.:
C27H26N2O
Mol. Mass.:
394.5081
SMILES:
O=c1[nH]c2ccc(CCCN3CCC(=CC3)c3ccccc3)cc2c2ccccc12
: