Target
Poly [ADP-ribose] polymerase 1
Ligand
BDBM50255501
Substrate
Meas. Tech.
ChEMBL_515852 (CHEMBL993111)
IC50
25±n/a nM
Citation
 Zhang, WTRuan, JLWu, PFJiang, FCZhang, LNFang, WChen, XLWang, YCao, BSChen, GYZhu, YJGu, JChen, JG Design, synthesis, and cytoprotective effect of 2-aminothiazole analogues as potent poly(ADP-ribose) polymerase-1 inhibitors. J Med Chem 52:718-25 (2009)  
Target
Name:
Poly [ADP-ribose] polymerase 1
Synonyms:
(ARTD1 or PARP1) 2.4.2.30 ADPRT ARTD1 Human diphtheria toxin-like ADP-ribosyltransferase (ARTD1 or PARP1) NT-PARP-1 PARP1 PPOL Poly [ADP-ribose] polymerase 1 (PARP) Poly [ADP-ribose] polymerase 1 (PARP1) Poly [ADP-ribose] polymerase 1, 28-kDa form Poly [ADP-ribose] polymerase 1, processed C-terminus Poly [ADP-ribose] polymerase-1 Poly(ADP-ribose) polymerase-1 (ARTD1/PARP1) Protein poly-ADP-ribosyltransferase PARP1 | Synonyms=ADPRT
Type:
Mol. Mass.:
113114.22
Organism:
Homo sapiens (Human)
Description:
P09874
Residue:
1014
  
Inhibitor
Name:
BDBM50255501
Synonyms:
3-(2,4-dioxo-2,3,4,5,7,8-hexahydro-1H-thiopyrano[4,3-d]pyrimidin-1-yl)-N-(2-oxo-2-(4-(pyridazin-4-yl)phenyl)ethyl)propanamide | CHEMBL480039
Type:
Small organic molecule
Emp. Form.:
C22H21N5O4S
Mol. Mass.:
451.498
SMILES:
O=C(CCn1c2CCSCc2c(=O)[nH]c1=O)NCC(=O)c1ccc(cc1)-c1ccnnc1
: