Target
Prostaglandin G/H synthase 2
Ligand
BDBM50255182
Substrate
Meas. Tech.
ChEMBL_516255 (CHEMBL985925)
IC50
3700±n/a nM
Citation
 Chowdhury, MAAbdellatif, KRDong, YRahman, MDas, DSuresh, MRKnaus, EE Synthesis of 1-(methanesulfonyl- and aminosulfonylphenyl)acetylenes that possess a 2-(N-difluoromethyl-1,2-dihydropyridin-2-one) pharmacophore: evaluation as dual inhibitors of cyclooxygenases and 5-lipoxygenase with anti-inflammatory activity. Bioorg Med Chem Lett 19:584-8 (2009)  
Target
Name:
Prostaglandin G/H synthase 2
Synonyms:
COX2 Cyclooxygenase 2 (COX-2) Cyclooxygenase-2 (COX-2 AA) Cyclooxygenase-2 (COX-2) PGH2_HUMAN PHS II Prostaglandin E synthase/G/H synthase 2 Prostaglandin-endoperoxide synthase 2
Type:
Enzyme
Mol. Mass.:
69003.89
Organism:
Homo sapiens (Human)
Description:
Recombinant Cox-2 provided by Cayman (Cayman Chemical Co.,Ann Arbor, MI).
Residue:
604
  
Inhibitor
Name:
BDBM50255182
Synonyms:
1-(3-Methylsulfonylphenyl)-2-[5-(1-difluoromethylpyrid-2-one)]acetylene CHEMBL482206
Type:
Small organic molecule
Emp. Form.:
C15H11F2NO3S
Mol. Mass.:
323.315
SMILES:
CS(=O)(=O)c1cccc(c1)C#Cc1ccc(=O)n(c1)C(F)F
: