Target
Prostaglandin G/H synthase 1
Ligand
BDBM50255181
Substrate
Meas. Tech.
ChEMBL_516254 (CHEMBL985924)
IC50
>100000±n/a nM
Citation
 Chowdhury, MAAbdellatif, KRDong, YRahman, MDas, DSuresh, MRKnaus, EE Synthesis of 1-(methanesulfonyl- and aminosulfonylphenyl)acetylenes that possess a 2-(N-difluoromethyl-1,2-dihydropyridin-2-one) pharmacophore: evaluation as dual inhibitors of cyclooxygenases and 5-lipoxygenase with anti-inflammatory activity. Bioorg Med Chem Lett 19:584-8 (2009)  
Target
Name:
Prostaglandin G/H synthase 1
Synonyms:
COX1 Cyclooxygenase-1 (COX-1) PTGS1 | Prostaglandin G/H synthase (cyclooxygenase)
Type:
Protein
Mol. Mass.:
68868.60
Organism:
Ovis aries (Sheep)
Description:
Residue:
600
  
Inhibitor
Name:
BDBM50255181
Synonyms:
1-(2-Methylsulfonylphenyl)-2-[5-(1-difluoromethylpyrid-2-one)]acetylene CHEMBL521440
Type:
Small organic molecule
Emp. Form.:
C15H11F2NO3S
Mol. Mass.:
323.315
SMILES:
CS(=O)(=O)c1ccccc1C#Cc1ccc(=O)n(c1)C(F)F
: