Target
Heat shock protein HSP 90-alpha
Ligand
BDBM50276627
Substrate
Meas. Tech.
ChEMBL_540982 (CHEMBL1028139)
Kd
42±n/a nM
Citation
 Cikotiene, IKazlauskas, EMatuliene, JMichailoviene, VTorresan, JJachno, JMatulis, D 5-Aryl-4-(5-substituted-2,4-dihydroxyphenyl)-1,2,3-thiadiazoles as inhibitors of Hsp90 chaperone. Bioorg Med Chem Lett 19:1089-92 (2009)  
Target
Name:
Heat shock protein HSP 90-alpha
Synonyms:
HS90A_HUMAN HSP86 HSP90AA1 HSPCA Heat shock 86 kDa Heat shock protein HSP 90-alpha (HSP90) LAP-2 Lipopolysaccharide-associated protein 2 heat shock protein 90kDa alpha (cytosolic), class A member 1 isoform 2
Type:
Molecular Chaperone
Mol. Mass.:
84623.45
Organism:
Homo sapiens (Human)
Description:
P07900
Residue:
732
  
Inhibitor
Name:
BDBM50276627
Synonyms:
4-(5-(4-ethoxyphenyl)-1,2,3-thiadiazol-4-yl)-6-ethylbenzene-1,3-diol | CHEMBL514748
Type:
Small organic molecule
Emp. Form.:
C18H18N2O3S
Mol. Mass.:
342.412
SMILES:
CCOc1ccc(cc1)-c1snnc1-c1cc(CC)c(O)cc1O
: