Target
Vascular endothelial growth factor receptor 3
Ligand
BDBM50248414
Substrate
Meas. Tech.
ChEMBL_566610 (CHEMBL964949)
IC50
1600±n/a nM
Citation
 Tasler, SMüller, OWieber, THerz, TKrauss, RTotzke, FKubbutat, MHSchächtele, C N-substituted 2'-(aminoaryl)benzothiazoles as kinase inhibitors: hit identification and scaffold hopping. Bioorg Med Chem Lett 19:1349-56 (2009)  
Target
Name:
Vascular endothelial growth factor receptor 3
Synonyms:
FLT-4 Fms-like tyrosine kinase 4 VEGFR-3 VGFR3_HUMAN Vascular endothelial growth factor receptor 3 (VEGFR-3) | Vascular endothelial growth factor receptor 3 (VEGFR3)
Type:
Protein
Mol. Mass.:
152749.58
Organism:
Homo sapiens (Human)
Description:
P35916-2
Residue:
1363
  
Inhibitor
Name:
BDBM50248414
Synonyms:
CHEMBL522785 | N4-(3-(benzo[d]thiazol-2-yl)phenyl)-6,7-dimethoxy-N2-(5-methyl-1H-pyrazol-3-yl)quinazoline-2,4-diamine
Type:
Small organic molecule
Emp. Form.:
C27H23N7O2S
Mol. Mass.:
509.582
SMILES:
COc1cc2nc(Nc3cc(C)n[nH]3)nc(Nc3cccc(c3)-c3nc4ccccc4s3)c2cc1OC
: