Target
Insulin receptor
Ligand
BDBM50248119
Substrate
Meas. Tech.
ChEMBL_566615 (CHEMBL960141)
IC50
>10000±n/a nM
Citation
 Tasler, SMüller, OWieber, THerz, TKrauss, RTotzke, FKubbutat, MHSchächtele, C N-substituted 2'-(aminoaryl)benzothiazoles as kinase inhibitors: hit identification and scaffold hopping. Bioorg Med Chem Lett 19:1349-56 (2009)  
Target
Name:
Insulin receptor
Synonyms:
INSR INSR_HUMAN Insulin receptor beta subunit
Type:
Receptor Tyrosine Kinase
Mol. Mass.:
156322.60
Organism:
Homo sapiens (Human)
Description:
P06213
Residue:
1382
  
Inhibitor
Name:
BDBM50248119
Synonyms:
CHEMBL462161 | N2-(4-(benzo[d]thiazol-2-yl)phenyl)-N4,N4-dimethylpyrimidine-2,4-diamine
Type:
Small organic molecule
Emp. Form.:
C19H17N5S
Mol. Mass.:
347.437
SMILES:
CN(C)c1ccnc(Nc2ccc(cc2)-c2nc3ccccc3s2)n1
: