Target
Low molecular weight phosphotyrosine protein phosphatase
Ligand
BDBM50267069
Substrate
Meas. Tech.
ChEMBL_563763 (CHEMBL993526)
IC50
8200±n/a nM
Citation
 Ottanà, RMaccari, RCiurleo, RPaoli, PJacomelli, MManao, GCamici, GLaggner, CLanger, T 5-Arylidene-2-phenylimino-4-thiazolidinones as PTP1B and LMW-PTP inhibitors. Bioorg Med Chem 17:1928-37 (2009)  
Target
Name:
Low molecular weight phosphotyrosine protein phosphatase
Synonyms:
3.1.3.2 ACP1 LMW-PTP LMWPTP PPAC_HUMAN low molecular weight phosphotyrosine protein phosphatase isoform c
Type:
Mol. Mass.:
18042.81
Organism:
Homo sapiens (Human)
Description:
P24666
Residue:
158
  
Inhibitor
Name:
BDBM50267069
Synonyms:
4-{[4-Oxo-5-(4-phenoxybenzylidene)-2-phenyliminothiazolidin-3-yl]methyl}benzoic acid | CHEMBL478274
Type:
Small organic molecule
Emp. Form.:
C30H22N2O4S
Mol. Mass.:
506.572
SMILES:
OC(=O)c1ccc(CN2\C(S\C(=C/c3ccc(Oc4ccccc4)cc3)C2=O)=N\c2ccccc2)cc1
: