Target
Cathepsin K
Ligand
BDBM50249448
Substrate
Meas. Tech.
ChEMBL_499502 (CHEMBL1021994)
IC50
9±n/a nM
Citation
 Morley, ADKenny, PWBurton, BHeald, RAMacfaul, PAMullett, JPage, KPorres, SSRibeiro, LRSmith, PWard, SWilkinson, TJ 5-Aminopyrimidin-2-ylnitriles as cathepsin K inhibitors. Bioorg Med Chem Lett 19:1658-61 (2009)  
Target
Name:
Cathepsin K
Synonyms:
CATK_HUMAN CTSO Cathepsin O Cathepsin X
Type:
Enzyme
Mol. Mass.:
36975.68
Organism:
Homo sapiens (Human)
Description:
P43235
Residue:
329
  
Inhibitor
Name:
BDBM50249448
Synonyms:
4-(4-acetylpiperazin-1-yl)-5-amino-6-(isobutylamino)pyrimidine-2-carbonitrile | CHEMBL514805
Type:
Small organic molecule
Emp. Form.:
C15H23N7O
Mol. Mass.:
317.3894
SMILES:
CC(C)CNc1nc(nc(N2CCN(CC2)C(C)=O)c1N)C#N
: