Target
Cytochrome P450 3A4
Ligand
BDBM50276432
Substrate
Meas. Tech.
ChEMBL_542857 (CHEMBL1022134)
IC50
1350±n/a nM
Citation
 Kraus, JMVerlinde, CLKarimi, MLepesheva, GIGelb, MHBuckner, FS Rational modification of a candidate cancer drug for use against Chagas disease. J Med Chem 52:1639-47 (2009)  
Target
Name:
Cytochrome P450 3A4
Synonyms:
Albendazole monooxygenase CP3A4_HUMAN CYP3A4 CYPIIIA4 Cytochrome P450 3A4 (CYP3A4) Nifedipine oxidase Taurochenodeoxycholate 6-alpha-hydroxylase
Type:
Enzyme
Mol. Mass.:
57349.57
Organism:
Homo sapiens (Human)
Description:
Residue:
503
  
Inhibitor
Name:
BDBM50276432
Synonyms:
(R)-6-(amino(4-chlorophenyl)(1-methyl-1H-imidazol-5-yl)methyl)-1-methyl-4-o-tolylquinolin-2(1H)-one | CHEMBL456002
Type:
Small organic molecule
Emp. Form.:
C28H25ClN4O
Mol. Mass.:
468.977
SMILES:
Cc1ccccc1-c1cc(=O)n(C)c2ccc(cc12)[C@@](N)(c1cncn1C)c1ccc(Cl)cc1
: