Target
Tyrosine-protein kinase ITK/TSK
Ligand
BDBM50257549
Substrate
Meas. Tech.
ChEMBL_562393 (CHEMBL1018826)
IC50
3±n/a nM
Citation
 Riether, DZindell, RKowalski, JACook, BNBentzien, JLombaert, SDThomson, DKugler, SZSkow, DMartin, LSRaymond, ELKhine, HHO'Shea, KWoska, JRJeanfavre, DSellati, RRalph, KLAhlberg, JLabissiere, GKashem, MAPullen, SSTakahashi, H 5-Aminomethylbenzimidazoles as potent ITK antagonists. Bioorg Med Chem Lett 19:1588-91 (2009)  
Target
Name:
Tyrosine-protein kinase ITK/TSK
Synonyms:
EMT ITK_HUMAN LYK Tyrosine-protein kinase ITK Tyrosine-protein kinase Lyk
Type:
Protein
Mol. Mass.:
71839.20
Organism:
Homo sapiens (Human)
Description:
Q08881
Residue:
620
  
Inhibitor
Name:
BDBM50257549
Synonyms:
CHEMBL492931 | N-(1-(2-hydroxy-2-methylpropyl)-5-(N-methylbenzamido)-1H-benzo[d]imidazol-2(3H)-ylidene)-5-(2-methyloxazol-5-yl)thiophene-2-carboxamide
Type:
Small organic molecule
Emp. Form.:
C28H27N5O4S
Mol. Mass.:
529.61
SMILES:
CN(C(=O)c1ccccc1)c1ccc2n(CC(C)(C)O)c(NC(=O)c3ccc(s3)-c3cnc(C)o3)nc2c1
: