Target
Tyrosine-protein kinase ITK/TSK
Ligand
BDBM50257917
Substrate
Meas. Tech.
ChEMBL_562396 (CHEMBL1018829)
IC50
13±n/a nM
Citation
 Riether, DZindell, RKowalski, JACook, BNBentzien, JLombaert, SDThomson, DKugler, SZSkow, DMartin, LSRaymond, ELKhine, HHO'Shea, KWoska, JRJeanfavre, DSellati, RRalph, KLAhlberg, JLabissiere, GKashem, MAPullen, SSTakahashi, H 5-Aminomethylbenzimidazoles as potent ITK antagonists. Bioorg Med Chem Lett 19:1588-91 (2009)  
Target
Name:
Tyrosine-protein kinase ITK/TSK
Synonyms:
EMT ITK_HUMAN LYK Tyrosine-protein kinase ITK Tyrosine-protein kinase Lyk
Type:
Protein
Mol. Mass.:
71839.20
Organism:
Homo sapiens (Human)
Description:
Q08881
Residue:
620
  
Inhibitor
Name:
BDBM50257917
Synonyms:
CHEMBL494027 | N-(1-(2-hydroxy-2-methylpropyl)-5-(morpholinomethyl)-1H-benzo[d]imidazol-2(3H)-ylidene)-5-(1H-pyrazol-4-yl)thiophene-2-carboxamide
Type:
Small organic molecule
Emp. Form.:
C24H28N6O3S
Mol. Mass.:
480.583
SMILES:
CC(C)(O)Cn1c(NC(=O)c2ccc(s2)-c2cn[nH]c2)nc2cc(CN3CCOCC3)ccc12
: