Target
Tyrosine-protein kinase ITK/TSK
Ligand
BDBM50257857
Substrate
Meas. Tech.
ChEMBL_562396 (CHEMBL1018829)
IC50
3±n/a nM
Citation
 Riether, DZindell, RKowalski, JACook, BNBentzien, JLombaert, SDThomson, DKugler, SZSkow, DMartin, LSRaymond, ELKhine, HHO'Shea, KWoska, JRJeanfavre, DSellati, RRalph, KLAhlberg, JLabissiere, GKashem, MAPullen, SSTakahashi, H 5-Aminomethylbenzimidazoles as potent ITK antagonists. Bioorg Med Chem Lett 19:1588-91 (2009)  
Target
Name:
Tyrosine-protein kinase ITK/TSK
Synonyms:
EMT ITK_HUMAN LYK Tyrosine-protein kinase ITK Tyrosine-protein kinase Lyk
Type:
Protein
Mol. Mass.:
71839.20
Organism:
Homo sapiens (Human)
Description:
Q08881
Residue:
620
  
Inhibitor
Name:
BDBM50257857
Synonyms:
(S)-N-(5-(((3,3-dimethylbutan-2-yl)(methyl)amino)methyl)-1-(2-hydroxy-2-methylpropyl)-1H-benzo[d]imidazol-2(3H)-ylidene)-5-(1H-pyrazol-4-yl)thiophene-2-carboxamide | CHEMBL522711
Type:
Small organic molecule
Emp. Form.:
C27H36N6O2S
Mol. Mass.:
508.679
SMILES:
C[C@H](N(C)Cc1ccc2n(CC(C)(C)O)c(NC(=O)c3ccc(s3)-c3cn[nH]c3)nc2c1)C(C)(C)C
: