Target
Cannabinoid receptor 2
Ligand
BDBM50169953
Substrate
Meas. Tech.
ChEMBL_564385 (CHEMBL962380)
Ki
14±n/a nM
Citation
 Ferreira, AMKrishnamurthy, MMoore, BMFinkelstein, DBashford, D Quantitative structure-activity relationship (QSAR) for a series of novel cannabinoid derivatives using descriptors derived from semi-empirical quantum-chemical calculations. Bioorg Med Chem 17:2598-606 (2009)  
Target
Name:
Cannabinoid receptor 2
Synonyms:
CANNABINOID CB2 CB2 CB2B CNR2_HUMAN Cannabinoid CB2 receptor Cannabinoid receptor 2 (CB2R) | hCB2
Type:
G Protein-Coupled Receptor (GPCR)
Mol. Mass.:
39690.94
Organism:
Homo sapiens (Human)
Description:
P34972
Residue:
360
  
Inhibitor
Name:
BDBM50169953
Synonyms:
(6aR,10aR)-3-Adamantan-2-yl-6,6,9-trimethyl-6a,7,10,10a-tetrahydro-6H-benzo[c]chromen-1-ol CHEMBL371167
Type:
Small organic molecule
Emp. Form.:
C26H34O2
Mol. Mass.:
378.547
SMILES:
CC1=CC[C@@H]2[C@@H](C1)c1c(O)cc(cc1OC2(C)C)C1C2CC3CC(C2)CC1C3
: