Target
Kappa-type opioid receptor
Ligand
BDBM50248828
Substrate
Meas. Tech.
ChEMBL_543309 (CHEMBL1019446)
Ki
0.12±n/a nM
Citation
 Cami-Kobeci, GNeal, APBradbury, FAPurington, LCAceto, MDHarris, LSLewis, JWTraynor, JRHusbands, SM Mixed kappa/mu opioid receptor agonists: the 6 beta-naltrexamines. J Med Chem 52:1546-52 (2009)  
Target
Name:
Kappa-type opioid receptor
Synonyms:
K-OR-1 Kappa-opioid receptor (KOR) Kappa-type opioid receptor (KOR) OPIATE Kappa OPRK1 kappa opioid receptor (KOR)
Type:
G Protein-Coupled Receptor (GPCR)
Mol. Mass.:
42648.76
Organism:
Homo sapiens (Human)
Description:
P41145
Residue:
380
  
Inhibitor
Name:
BDBM50248828
Synonyms:
14beta-Allyloxy-17-cyclopropylmethyl-4,5alpha-epoxy-3-hydroxy-6beta-(cinnamoylamino)morphinan | CHEMBL472410
Type:
Small organic molecule
Emp. Form.:
C32H36N2O4
Mol. Mass.:
512.6392
SMILES:
Oc1ccc2C[C@H]3N(CC4CC4)CC[C@@]45[C@@H](Oc1c24)[C@@H](CC[C@@]35OCC=C)NC(=O)\C=C\c1ccccc1
: