Target
Sphingosine 1-phosphate receptor 5
Ligand
BDBM50249294
Substrate
Meas. Tech.
ChEMBL_499716 (CHEMBL980651)
IC50
3.5±n/a nM
Citation
 Evindar, GSatz, ALBernier, SGKavarana, MJDoyle, ELorusso, JTaghizadeh, NHalley, KHutchings, AKelley, MSWright, ADSaha, AKHannig, GMorgan, BAWestlin, WF Synthesis and evaluation of arylalkoxy- and biarylalkoxy-phenylamide and phenylimidazoles as potent and selective sphingosine-1-phosphate receptor subtype-1 agonists. Bioorg Med Chem Lett 19:2315-9 (2009)  
Target
Name:
Sphingosine 1-phosphate receptor 5
Synonyms:
EDG8 S1P5 S1PR5_HUMAN Sphingosine 1-phosphate receptor Edg-8
Type:
G Protein-Coupled Receptor (GPCR)
Mol. Mass.:
41796.42
Organism:
Homo sapiens (Human)
Description:
Residue:
398
  
Inhibitor
Name:
BDBM50249294
Synonyms:
(R)-2-amino-2-(4-(4-(5-phenylpentyloxy)phenyl)-1H-imidazol-2-yl)propyl dihydrogen phosphate | CHEMBL470511
Type:
Small organic molecule
Emp. Form.:
C23H30N3O5P
Mol. Mass.:
459.4752
SMILES:
C[C@](N)(COP(O)(O)=O)c1nc(c[nH]1)-c1ccc(OCCCCCc2ccccc2)cc1
: