Target
RAC-alpha serine/threonine-protein kinase
Ligand
BDBM50278568
Substrate
Meas. Tech.
ChEMBL_565646 (CHEMBL959242)
IC50
3±n/a nM
Citation
 Seefeld, MARouse, MBMcNulty, KCSun, LWang, JYamashita, DSLuengo, JIZhang, SMinthorn, EAConcha, NOHeerding, DA Discovery of 5-pyrrolopyridinyl-2-thiophenecarboxamides as potent AKT kinase inhibitors. Bioorg Med Chem Lett 19:2244-8 (2009)  
Target
Name:
RAC-alpha serine/threonine-protein kinase
Synonyms:
AKT phosphorylation (p-AKT) AKT1/PPP1CA C-AKT PKB alpha Protein kinase B Protein kinase B (Akt 1) Protein kinase B alpha Proto-oncogene Akt (Akt1) Proto-oncogene c-Akt (AKT1) RAC-PK-alpha RAC-alpha serine/threonine-protein kinase (AKT1) | RAC-alpha serine/threonine-protein kinase (pAKT)
Type:
Enzyme
Mol. Mass.:
55681.25
Organism:
Homo sapiens (Human)
Description:
P31749
Residue:
480
  
Inhibitor
Name:
BDBM50278568
Synonyms:
CHEMBL512480 | N-(5-(1H-pyrrolo[2,3-b]pyridin-4-yl)thiophen-2-yl)-3-amino-2-phenylpropanamide
Type:
Small organic molecule
Emp. Form.:
C20H18N4OS
Mol. Mass.:
362.448
SMILES:
NCC(C(=O)Nc1ccc(s1)-c1ccnc2[nH]ccc12)c1ccccc1
: