Target
Inhibitor of nuclear factor kappa-B kinase subunit beta
Ligand
BDBM50256912
Substrate
Meas. Tech.
ChEMBL_562542 (CHEMBL1014534)
IC50
1760±n/a nM
Citation
 Nagarajan, SDoddareddy, MChoo, HCho, YSOh, KSLee, BHPae, AN IKKbeta inhibitors identification part I: homology model assisted structure based virtual screening. Bioorg Med Chem 17:2759-66 (2009)  
Target
Name:
Inhibitor of nuclear factor kappa-B kinase subunit beta
Synonyms:
I-kappa-B Kinase 2 (IKK-beta) I-kappa-B-kinase beta IKBKB IKK-beta IKK2/IKK1 IKKB_HUMAN Inhibitor of nuclear factor kappa B kinase beta subunit Nuclear factor NF-kappa-B inhibitor kinase beta
Type:
Serine/threonine-protein kinase
Mol. Mass.:
86554.39
Organism:
Homo sapiens (Human)
Description:
GST-tagged IKK-2 was expressed in High Five cells and purified.
Residue:
756
  
Inhibitor
Name:
BDBM50256912
Synonyms:
(Z)-5-(3,4-dihydroxybenzylidene)-2-iminothiazolidin-4-one | CHEMBL474389
Type:
Small organic molecule
Emp. Form.:
C10H8N2O3S
Mol. Mass.:
236.247
SMILES:
Oc1ccc(\C=C2/SC(=N)NC2=O)cc1O
: