Target
Inhibitor of nuclear factor kappa-B kinase subunit beta
Ligand
BDBM50230828
Substrate
Meas. Tech.
ChEMBL_562542 (CHEMBL1014534)
IC50
18±n/a nM
Citation
 Nagarajan, SDoddareddy, MChoo, HCho, YSOh, KSLee, BHPae, AN IKKbeta inhibitors identification part I: homology model assisted structure based virtual screening. Bioorg Med Chem 17:2759-66 (2009)  
Target
Name:
Inhibitor of nuclear factor kappa-B kinase subunit beta
Synonyms:
I-kappa-B Kinase 2 (IKK-beta) I-kappa-B-kinase beta IKBKB IKK-beta IKK2/IKK1 IKKB_HUMAN Inhibitor of nuclear factor kappa B kinase beta subunit Nuclear factor NF-kappa-B inhibitor kinase beta
Type:
Serine/threonine-protein kinase
Mol. Mass.:
86554.39
Organism:
Homo sapiens (Human)
Description:
GST-tagged IKK-2 was expressed in High Five cells and purified.
Residue:
756
  
Inhibitor
Name:
BDBM50230828
Synonyms:
5-(4-fluorophenyl)-2-ureidothiophene-3-carboxamide [5-(p-fluorophenyl)-2-ureido]thiophene-3-carboxamide
Type:
Small organic molecule
Emp. Form.:
C12H10FN3O2S
Mol. Mass.:
279.29
SMILES:
NC(=O)Nc1sc(cc1C(N)=O)-c1ccc(F)cc1
: