Target
Neurotensin receptor type 1
Ligand
BDBM50257187
Substrate
Meas. Tech.
ChEMBL_562549 (CHEMBL1014541)
Ki
4.87±n/a nM
Citation
 Orwig, KSLassetter, MRHadden, MKDix, TA Comparison of N-terminal modifications on neurotensin(8-13) analogues correlates peptide stability but not binding affinity with in vivo efficacy. J Med Chem 52:1803-13 (2009)  
Target
Name:
Neurotensin receptor type 1
Synonyms:
Dopamine receptor D2L/neurotensin receptor NTS1 NTRR Neurotensin receptor 1 | neurotensin receptor type 1
Type:
PROTEIN
Mol. Mass.:
46278.89
Organism:
Homo sapiens (Human)
Description:
ChEMBL_1453811
Residue:
418
  
Inhibitor
Name:
BDBM50257187
Synonyms:
(S)-2-((2S,3R)-2-((S)-2-((S)-1-((S)-2-((S)-2-amino-5-guanidino-2-methylpentanamido)-5-guanidinopentanoyl)pyrrolidine-2-carboxamido)-3-(4-hydroxyphenyl)propanamido)-3-methylpentanamido)-4-methylpentanoic acid | CHEMBL501575
Type:
Small organic molecule
Emp. Form.:
C39H66N12O8
Mol. Mass.:
831.0169
SMILES:
[#6]-[#6]-[#6@@H](-[#6])-[#6@H](-[#7]-[#6](=O)-[#6@H](-[#6]-c1ccc(-[#8])cc1)-[#7]-[#6](=O)-[#6@@H]-1-[#6]-[#6]-[#6]-[#7]-1-[#6](=O)-[#6@H](-[#6]-[#6]-[#6]\[#7]=[#6](\[#7])-[#7])-[#7]-[#6](=O)[C@@]([#6])([#7])[#6]-[#6]-[#6]\[#7]=[#6](\[#7])-[#7])-[#6](=O)-[#7]-[#6@@H](-[#6]-[#6](-[#6])-[#6])-[#6](-[#8])=O
: