Target
Neurotensin receptor type 1
Ligand
BDBM50257190
Substrate
Meas. Tech.
ChEMBL_562549 (CHEMBL1014541)
Ki
136±n/a nM
Citation
 Orwig, KSLassetter, MRHadden, MKDix, TA Comparison of N-terminal modifications on neurotensin(8-13) analogues correlates peptide stability but not binding affinity with in vivo efficacy. J Med Chem 52:1803-13 (2009)  
Target
Name:
Neurotensin receptor type 1
Synonyms:
Dopamine receptor D2L/neurotensin receptor NTS1 NTRR Neurotensin receptor 1 | neurotensin receptor type 1
Type:
PROTEIN
Mol. Mass.:
46278.89
Organism:
Homo sapiens (Human)
Description:
ChEMBL_1453811
Residue:
418
  
Inhibitor
Name:
BDBM50257190
Synonyms:
(S)-2-((S)-2-((S)-2-((S)-1-((S)-2-((S)-3-acetamido-7-aminoheptanamido)-5-guanidinopentanoyl)pyrrolidine-2-carboxamido)-3-(4-hydroxyphenyl)propanamido)-3,3-dimethylbutanamido)-4-methylpentanoic acid | CHEMBL508507
Type:
Small organic molecule
Emp. Form.:
C41H68N10O9
Mol. Mass.:
845.0402
SMILES:
[#6]-[#6](-[#6])-[#6]-[#6@H](-[#7]-[#6](=O)-[#6@@H](-[#7]-[#6](=O)-[#6@H](-[#6]-c1ccc(-[#8])cc1)-[#7]-[#6](=O)-[#6@@H]-1-[#6]-[#6]-[#6]-[#7]-1-[#6](=O)-[#6@H](-[#6]-[#6]-[#6]\[#7]=[#6](\[#7])-[#7])-[#7]-[#6](=O)-[#6]-[#6@H](-[#6]-[#6]-[#6]-[#6]-[#7])-[#7]-[#6](-[#6])=O)C([#6])([#6])[#6])-[#6](-[#8])=O
: