Target
Neurotensin receptor type 1
Ligand
BDBM50257191
Substrate
Meas. Tech.
ChEMBL_562549 (CHEMBL1014541)
Ki
20.3±n/a nM
Citation
 Orwig, KSLassetter, MRHadden, MKDix, TA Comparison of N-terminal modifications on neurotensin(8-13) analogues correlates peptide stability but not binding affinity with in vivo efficacy. J Med Chem 52:1803-13 (2009)  
Target
Name:
Neurotensin receptor type 1
Synonyms:
Dopamine receptor D2L/neurotensin receptor NTS1 NTRR Neurotensin receptor 1 | neurotensin receptor type 1
Type:
PROTEIN
Mol. Mass.:
46278.89
Organism:
Homo sapiens (Human)
Description:
ChEMBL_1453811
Residue:
418
  
Inhibitor
Name:
BDBM50257191
Synonyms:
(S)-2-((S)-2-((S)-2-((S)-1-((S)-2-((S)-7-amino-3-(methylamino)heptanamido)-5-guanidinopentanoyl)pyrrolidine-2-carboxamido)-3-(4-hydroxyphenyl)propanamido)-3,3-dimethylbutanamido)-4-methylpentanoic acid | CHEMBL447400
Type:
Small organic molecule
Emp. Form.:
C40H68N10O8
Mol. Mass.:
817.0301
SMILES:
[#6]-[#7]-[#6@@H](-[#6]-[#6]-[#6]-[#6]-[#7])-[#6]-[#6](=O)-[#7]-[#6@@H](-[#6]-[#6]-[#6]\[#7]=[#6](\[#7])-[#7])-[#6](=O)-[#7]-1-[#6]-[#6]-[#6]-[#6@H]-1-[#6](=O)-[#7]-[#6@@H](-[#6]-c1ccc(-[#8])cc1)-[#6](=O)-[#7]-[#6@H](-[#6](=O)-[#7]-[#6@@H](-[#6]-[#6](-[#6])-[#6])-[#6](-[#8])=O)C([#6])([#6])[#6]
: