Target
Neurotensin receptor type 1
Ligand
BDBM50240339
Substrate
Meas. Tech.
ChEMBL_562555 (CHEMBL1014547)
Ki
95±n/a nM
Citation
 Orwig, KSLassetter, MRHadden, MKDix, TA Comparison of N-terminal modifications on neurotensin(8-13) analogues correlates peptide stability but not binding affinity with in vivo efficacy. J Med Chem 52:1803-13 (2009)  
Target
Name:
Neurotensin receptor type 1
Synonyms:
Dopamine receptor D2L/neurotensin receptor NTS1 NTRR Neurotensin receptor 1 | neurotensin receptor type 1
Type:
PROTEIN
Mol. Mass.:
46278.89
Organism:
Homo sapiens (Human)
Description:
ChEMBL_1453811
Residue:
418
  
Inhibitor
Name:
BDBM50240339
Synonyms:
(S)-2-((S)-2-((S)-2-((S)-1-((S)-6-amino-2-((S)-5-guanidino-2-(methylamino)pentanamido)hexanoyl)pyrrolidine-2-carboxamido)-3-(1H-indol-3-yl)propanamido)-3,3-dimethylbutanamido)-4-methylpentanoic acid CHEMBL266571 | Neurotensin 2
Type:
Small organic molecule
Emp. Form.:
C41H67N11O7
Mol. Mass.:
826.0402
SMILES:
CN[C@@H](CCCN=C(N)N)C(=O)N[C@@H](CCCCN)C(=O)N1CCC[C@H]1C(=O)N[C@@H](Cc1c[nH]c2ccccc12)C(=O)N[C@H](C(=O)N[C@@H](CC(C)C)C(O)=O)C(C)(C)C
: