Target
Caspase-3
Ligand
BDBM50257356
Substrate
Meas. Tech.
ChEMBL_562695 (CHEMBL1012730)
IC50
25±n/a nM
Citation
 Podichetty, AKFaust, AKopka, KWagner, SSchober, OSchäfers, MHaufe, G Fluorinated isatin derivatives. Part 1: synthesis of new N-substituted (S)-5-[1-(2-methoxymethylpyrrolidinyl)sulfonyl]isatins as potent caspase-3 and -7 inhibitors. Bioorg Med Chem 17:2680-8 (2009)  
Target
Name:
Caspase-3
Synonyms:
Apopain CASP3 CPP-32 Caspase 3 Caspase-3 subunit p17 SCA-1 Yama protein | caspase-3 preproprotein
Type:
Hydrolase; heterotetramer of two heterodimers
Mol. Mass.:
31607.55
Organism:
Homo sapiens (Human)
Description:
Residue:
277
  
Inhibitor
Name:
BDBM50257356
Synonyms:
(S)-1-(3-Fluorobutyl)-5-[1-(2-methoxymethylpyrrolidinyl)sulfonyl]isatin | CHEMBL494141
Type:
Small organic molecule
Emp. Form.:
C18H23FN2O5S
Mol. Mass.:
398.449
SMILES:
COC[C@@H]1CCCN1S(=O)(=O)c1ccc2N(CCC(C)F)C(=O)C(=O)c2c1
: